{"text_format":"1","workbook":"xlsx","n_sheets":6,"sheets":["base","要領1","data","個人","要領2","一括"],"not_rendered":{"charts":0,"images":17,"macros":1,"external_links":0,"defined_names":5,"comments":1,"pivot_tables":0},"unopened":[],"bounds":{"document_bytes":16777216,"sheet_cells":100000,"rows_first":2000,"rows_last":500,"rows_between":2000,"halvings":0,"cell_chars":16384,"cell_head_chars":4096},"cells_cut":0,"cells_raw":0,"read":"whole","date_system":"1900"}

{"sheet":"base","index":0,"n_rows":54,"n_cols":4,"rows_kept":54,"cut":false,"hidden":false,"merged":[]}
[]
[null,"ホームページからの対応"]
[]
[null,"そのまま、[ファイルのダウンロード]→[ファイルを開く]と実行すると動作しません。"]
[null,"以下の手順で処理してから、下段の「帳票の選択」をしてください。"]
[]
[]
[]
[]
[]
[]
[]
[]
[]
[]
[]
[]
[]
[]
[]
[]
[]
[]
[]
[]
[]
[]
[]
[]
[]
[]
[]
[]
[]
[]
[]
[]
[]
[]
[]
{"$rows_left_out":15}
{"sheet":"要領1","index":1,"n_rows":32,"n_cols":28,"rows_kept":32,"cut":false,"hidden":true,"merged":[]}
[]
[]
[null,{"$f":"\"インフルエンザ予防接種補助金請求要領　（\"&data!J4&\"年度用）\"","v":"インフルエンザ予防接種補助金請求要領　（2023年度用）"},null,null,null,null,null,null,null,null,null,null,null,null,"（個人・家族用）"]
[]
[null,null,"１．","対象者",null,"接種日時点で当健保の被保険者（本人）または被扶養者（当健保に加入している家族）です。",null,null,null,null,null,null,null,null,null,null,null,null,null,null,null,null,null,null,null,null,null,9]
[null,null,null,null,null,{"$f":"\"※ 接種対象期間 : \"&TEXT(DATE(data!J4,10,1),\"yyyy年m月d日（aaa）\")&\"～ \"&TEXT(data!J11,\"yyyy年m月d日（aaa）\")&\" 接種分\"","v":"※ 接種対象期間 : 2023年10月1日(日)～ 2024年1月31日(水) 接種分"}]
[]
[null,null,"２．","補助金額",null,{"$f":"\"インフルエンザ予防接種者一人当たり年度内上限\"&TEXT(data!J6,\"#,##0円\")","v":"インフルエンザ予防接種者一人当たり年度内上限2,000円"}]
[]
[null,null,"３．","請求方法",null,"インフルエンザ予防接種補助金請求書に、領収書（原本・返却不可）を添付して申請してください。"]
[]
[null,null,"４．","請求期限",null,{"$f":"TEXT(data!J5,\"yyyy年m月d日（aaa）\")&\"　健保組合到着分まで\"","v":"2024年2月13日(火)　健保組合到着分まで"}]
[null,null,null,null,null,"※ 請求期限後に到着した場合、補助金は支給できません。（請求書は返却）"]
[]
[null,null,"５．","注意点",null,"①","接種日・接種者・インフルエンザの予防接種であることが分かる領収書（原本）が必要です。"]
[null,null,null,null,null,"②","請求書に上記の領収書（原本）を添付して期限内に提出して下さい。 "]
[null,null,null,null,null,"","※ 領収書には名宛が必須です。（名宛がない場合は、余白に接種者のフルネームを補記）"]
[null,null,null,null,null,null,"※ 領収書には「インフルエンザ」もしくは「予防接種」という記載が必須です。"]
[null,null,null,null,null,null,"※ レシート・診療明細書・接種済証は、単独では領収書の代用にはなりません。"]
[null,null,null,null,null,null,"※ レシートの場合は、接種者等が分かる診療明細書もしくは接種済証を添付してください。"]
[null,null,null,null,null,null,"※ 領収書はビニール袋等で請求書と散逸しないようにし、のり付け・ホッチキス留は厳禁です。"]
[null,null,null,null,null,null,"※ 理由を問わず、領収書は返却いたしません。"]
[null,null,null,null,null,null,"※ 2回接種の場合で、1回分の接種で2,000円に達していれば、1回分のみで請求して下さい。"]
[null,null,null,null,null,null,null,"1回分の接種で2,000円に達していない場合のみ、1・2回目合計で請求して下さい。"]
[]
[]
[null,null,null,"上記要領を確認しました。",null,null,null,null,null,null,null,"[確認]ボタンを押して、入力画面へ"]
[]
[]
[]
[null,null,null,null,null,null,null,null,null,null,null,null,null,null,null,null,null,null,null,null,null,null,null,null,null,null,"区分",0]
[null,null,null,null,null,null,null,null,null,null,null,null,null,null,null,null,null,null,null,null,null,null,null,null,null,null,"確認"]

{"sheet":"data","index":2,"n_rows":53,"n_cols":10,"rows_kept":53,"cut":false,"hidden":true,"merged":[]}
[]
[]
[null,"code順",null,"あいうえお順"]
[null,1011,"りそな銀行従業員組合","ＤＡＣＳ",null,"本人",0,null,"本年度",2023]
[null,1021,"ディー・エフ・エル・リース","ジェイアンドエス保険サービス",null,"父",11,null,"受付期限","2024-02-13"]
[null,1032,"ＤＡＣＳ","ディー・エフ・エル・リース",null,"母",12,null,"上限額",2000]
[null,1043,"りそなホールディングス","ひょうご経済研究所",null,"夫",21]
[null,2022,"大阪総合信用","びわこ信用保証",null,"妻",22,null,"設定Mode","QR"]
[null,2027,"関西みらい保証","びわこ総合サービス",null,"長男",31]
[null,3208,"りそな決済サービス","みなとカード",null,"二男",32,null,"接種期間","2023-10-01"]
[null,3216,"りそなキャピタル","みなとキャピタル",null,"三男",33,null,null,"2024-01-31"]
[null,3224,"りそな保証","みなとシステム",null,"四男",34]
[null,3227,"りそなカード","みなとビジネスサービス",null,"養子",38]
[null,3229,"ジェイアンドエス保険サービス","みなとリース",null,"長女",41]
[null,3230,"首都圏リース","みなと銀行",null,"二女",42]
[null,3236,"りそな総合研究所","みなと保証",null,"三女",43]
[null,4001,"りそな健康保険組合","りそなアセットマネジメント",null,"四女",44]
[null,4002,"りそな企業年金基金","りそなカード",null,"養女",48]
[null,4003,"りそなビジネスサービス","りそなキャピタル",null,"兄",51]
[null,4004,"関西みらいフィナンシャルグループ","りそなビジネスサービス",null,"姉",52]
[null,4005,"りそなアセットマネジメント","りそなホールディングス",null,"弟",53]
[null,4006,"首都圏アグリファーム","りそなみらいズ",null,"妹",54]
[null,4010,"りそな銀行","りそな企業年金基金",null,"孫男",56]
[null,4017,"埼玉りそな銀行","りそな銀行",null,"孫女",57]
[null,4099,"任意継続","りそな銀行従業員組合",null,"義父",71]
[null,4159,"関西みらい銀行","りそな決済サービス",null,"義母",72]
[null,4562,"みなと銀行","りそな健康保険組合",null,"他",99]
[null,5002,"関西みらいリース","りそな総合研究所"]
[null,5003,"関西総合信用","りそな保証"]
[null,5006,"びわこ信用保証","関西みらいフィナンシャルグループ"]
[null,5007,"りそなみらいズ","関西みらいリース"]
[null,5008,"泉興産","関西みらい教育文化財団"]
[null,5009,"びわこ総合サービス","関西みらい銀行"]
[null,5010,"関西みらい教育文化財団","関西みらい保証"]
[null,5563,"みなとビジネスサービス","関西総合信用"]
[null,5565,"みなと保証","埼玉りそな銀行"]
[null,5566,"みなとリース","首都圏アグリファーム"]
[null,5567,"みなとカード","首都圏リース"]
[null,5568,"みなとシステム","神戸みなとサービス"]
[null,5569,"みなとキャピタル","神戸みなと興産"]
{"$rows_left_out":14}
{"sheet":"個人","index":3,"n_rows":98,"n_cols":88,"rows_kept":98,"cut":false,"hidden":true,"merged":[[70,30,72,30],[70,31,72,31],[71,32,71,35],[71,57,72,60],[72,32,72,35],[35,39,35,42],[38,28,39,31],[47,44,47,49],[47,50,47,55],[48,38,48,43],[48,44,48,49],[48,50,48,55],[36,53,37,61],[48,56,48,61],[48,32,48,37],[47,32,47,37],[45,38,45,43],[45,44,45,49],[45,50,45,55],[46,38,46,43],[46,44,46,49],[5,3,10,3],[12,3,15,3],[9,4,10,4],[7,6,7,7],[8,6,8,7],[5,4,5,5],[6,4,6,5],[7,4,7,5],[8,4,8,5],[12,4,12,5],[13,4,13,5],[14,4,14,5],[15,4,15,5],[40,28,41,31],[40,32,41,45],[46,32,46,37],[46,56,46,61],[47,56,47,61],[46,50,46,55],[47,38,47,43],[39,32,39,36],[45,32,45,37],[45,56,45,61],[39,37,39,43],[40,50,40,61],[41,54,41,60],[31,67,31,68],[31,69,31,71],[40,46,41,49],[38,44,39,47],[38,48,39,58],[38,59,39,61]]}
[]
[]
[]
[null,null,{"$f":"\"インフルエンザ予防接種補助金請求書（\"&data!J4&\"年度）\"","v":"インフルエンザ予防接種補助金請求書（2023年度）"},null,null,null,null,null,null,null,null,null,null,null,null,null,null,null,null,null,null,null,null,null,null,null,null,"戻る"]
[null,null,null,"［個人・家族用］",null,null,null,null,null,null,null,null,null,null,null,null,null,null,null,null,null,null,null,null,null,null,null,"g6:g7,g8:h9,g10:g11,g13:k16"]
[null,null,null,"被保険者","記号"]
[null,null,null,null,"番号"]
[null,null,null,null,"事業所名"]
[null,null,null,null,"部店名"]
[null,null,null,null,"勤務中\n連絡先","外線",null,null,null,null,null,null,null,null,null,null,null,null,null,null,null,null,null,null,null,null,{"$f":"IF(AND(G10=\"\",G11=\"\"),9,1)","v":9},"連絡先Tel"]
[null,null,null,null,null,"内線"]
[null,null,null,null,null,null,"①","②","③","④","⑤",null,null,null,null,null,null,null,null,null,null,null,null,null,null,null,"①","②","③","④","⑤"]
[null,null,null,"受診者","名前",null,null,null,null,null,null,null,null,null,null,null,null,null,null,null,null,null,null,null,null,null,{"$f":"IF(G13=\"\",9,1)","v":9},9,9,9,9]
[null,null,null,null,"続柄",null,null,null,null,null,null,null,null,null,null,null,null,null,null,null,null,null,null,null,null,null,9,9,9,9,9]
[null,null,null,null,"予防接種費用",null,null,null,null,null,null,null,null,null,null,null,null,null,null,null,null,null,null,null,null,null,9,9,9,9,9]
[null,null,null,null,"初回接種日",null,null,null,null,null,null,null,null,null,null,null,null,null,null,null,null,null,null,null,null,null,9,9,9,9,9]
[null,null,null,null,null,null,{"$f":"\"日付入力例 ： 11月15日→11/15　前年の場合→\"&data!J4&\"/11/15\"","v":"日付入力例 ： 11月15日→11/15　前年の場合→2023/11/15"},null,null,null,null,null,null,null,null,null,null,null,null,null,null,null,null,null,null,null,{"$f":"IF(AND(COUNTIF(AA13:AA16,1)>0,COUNTIF(AA13:AA16,9)>0),19,1)","v":1},{"$f":"IF(AND(COUNTIF(AB13:AB16,1)>0,COUNTIF(AB13:AB16,9)>0),29,1)","v":1},{"$f":"IF(AND(COUNTIF(AC13:AC16,1)>0,COUNTIF(AC13:AC16,9)>0),39,1)","v":1},{"$f":"IF(AND(COUNTIF(AD13:AD16,1)>0,COUNTIF(AD13:AD16,9)>0),49,1)","v":1},{"$f":"IF(AND(COUNTIF(AE13:AE16,1)>0,COUNTIF(AE13:AE16,9)>0),59,1)","v":1},{"$f":"COUNTIF(AA17:AE17,\">\"&1)","v":0}]
[null,null,null,null,null,null,null,null,null,null,null,null,null,null,null,null,null,null,null,null,null,null,null,null,null,null,{"$f":"IF(AA17>1,\"g\"&MATCH(9,AA1:AA16,0),\"\")","v":""},{"$f":"IF(AB17>1,\"h\"&MATCH(9,AB1:AB16,0),\"\")","v":""},{"$f":"IF(AC17>1,\"i\"&MATCH(9,AC1:AC16,0),\"\")","v":""},{"$f":"IF(AD17>1,\"j\"&MATCH(9,AD1:AD16,0),\"\")","v":""},{"$f":"IF(AE17>1,\"k\"&MATCH(9,AE1:AE16,0),\"\")","v":""},{"$f":"IF(AF17=0,\"\",HLOOKUP(SMALL(AA17:AE17,COUNTIF(AA17:AE17,1)+1),AA17:AE18,2,0))","v":""}]
[]
[]
[]
[null,null,null,null,null,null,null,null,null,null,null,null,null,null,null,null,null,null,null,null,null,null,null,null,null,null,null,{"$f":"IF(COUNTIF(G13:H13,H13)>1,9,0)","v":0},{"$f":"IF(COUNTIF(G13:I13,I13)>1,9,0)","v":0},{"$f":"IF(COUNTIF(G13:J13,J13)>1,9,0)","v":0},{"$f":"IF(COUNTIF(G13:K13,K13)>1,9,0)","v":0},{"$f":"IF(COUNTIF(AA22:AE22,9)>0,9,0)","v":0},null,"二重入力"]
[null,null,null,null,null,null,null,null,null,null,null,null,null,null,null,null,null,null,null,null,null,null,null,null,null,null,null,{"$f":"IF(COUNTIF(G14:H14,H14)>1,9,0)","v":0},{"$f":"IF(COUNTIF(G14:I14,I14)>1,9,0)","v":0},{"$f":"IF(COUNTIF(G14:J14,J14)>1,9,0)","v":0},{"$f":"IF(COUNTIF(G14:K14,K14)>1,9,0)","v":0},{"$f":"IF(COUNTIF(AA23:AE23,9)>0,9,0)","v":0}]
[]
[null,null,null,null,null,null,null,null,null,null,null,null,null,null,null,null,null,null,null,null,null,null,null,null,null,null,{"$f":"IF(G6=\"\",\"\",VLOOKUP(G6,data!B4:C53,2,0))","v":""}]
[]
[null,null,null,null,null,null,null,null,null,null,null,null,null,null,null,null,null,null,null,null,null,null,null,null,null,null,null,{"$f":"MATCH(\"▼\",AA:AA,0)","v":32},{"$f":"MATCH(\"▲\",AA:AA,0)","v":81},{"$f":"AC27-AB27","v":49}]
[null,null,null,null,null,null,null,null,null,null,null,null,null,null,null,null,null,null,null,null,null,null,null,null,null,null,null,{"$f":"AB27&\":\"&AC27","v":"32:81"}]
[null,null,null,null,null,null,null,null,null,null,null,null,null,null,null,null,null,null,null,null,null,null,null,null,null,null,null,{"$f":"\"2:\"&AC27-AB27+2","v":"2:51"}]
[]
[]
[null,null,null,null,null,null,null,null,null,null,null,null,null,null,null,null,null,null,null,null,null,null,null,null,null,null,"▼",null,null,null,null,null,null,null,null,null,null,null,null,null,null,null,null,null,null,null,null,null,null,null,null,null,null,null,null,null,null,null,null,null,null,{"$f":"IF(G6=0,\"請求日　　　 年　　月　　日\",\"請求日　\"&TEXT(BR32,\"ｙｙｙｙ年 ｍ月 d日\"))","v":"請求日　　　 年　　月　　日"},null,null,null,null,null,"請求日",null,{"$f":"IF(MAX(G16:K16)>TODAY(),MAX(G16:K16),TODAY())","v":"2023-11-08"}]
[null,null,null,null,null,null,null,null,null,null,null,null,null,null,null,null,null,null,null,null,null,null,null,null,null,null,null,null,"りそな健康保険組合　御中"]
[]
[null,null,null,null,null,null,null,null,null,null,null,null,null,null,null,null,null,null,null,null,null,null,null,null,null,null,null,null,{"$f":"\"インフルエンザ予防接種補助金請求書（\"&data!J4&\"年度用）\"","v":"インフルエンザ予防接種補助金請求書（2023年度用）"}]
[]
[null,null,null,null,null,null,null,null,null,null,null,null,null,null,null,null,null,null,null,null,null,null,null,null,null,null,null,null,"下記のとおりインフルエンザ予防接種を受けましたので、補助金を請求いたします。",null,null,null,null,null,null,null,null,null,null,null,null,null,null,null,null,null,null,null,null,null,null,null,null,"※ 被保険者自署必須"]
[null,null,null,null,null,null,null,null,null,null,null,null,null,null,null,null,null,null,null,null,null,null,null,null,null,null,null,null,null,null,null,null,null,null,null,null,null,null,null,null,null,null,null,null,null,null,null,null,null,null,null,null,null,null,null,null,null,null,null,null,null,null,null,null,null,null,null,null,null,"(1)",null,null,"(2)",null,null,"(3)",null,null,"(4)",null,null,"(5)"]
[null,null,null,null,null,null,null,null,null,null,null,null,null,null,null,null,null,null,null,null,null,null,null,null,null,null,null,null,"被保険者証\n記号・番号",null,null,null," 記号",null,null,null,null," 番号",null,"（最大６桁）",null,null,null,null,"被保険者\n氏名",null,null,null,{"$f":"IF(G6=4099,\"\",\"(ビジネスネーム不可)\")","v":"(ビジネスネーム不可)"},null,null,null,null,null,null,null,null,null,null,"(自署)",null,null,null,null,null,null,null,"記号","番号","続柄","補助額","接種日","続柄","補助額","接種日","続柄","補助額","接種日","続柄","補助額","接種日","続柄","補助額","接種日"]
[null,null,null,null,null,null,null,null,null,null,null,null,null,null,null,null,null,null,null,null,null,null,null,null,null,null,null,null,null,null,null,null,{"$f":"IF(G6=\"\",\"\",G6)","v":""},null,null,null,null,{"$f":"G7","v":0},null,null,null,null,null,null,null,null,null,null,null,null,null,null,null,null,null,null,null,null,null,null,null,null,null,null,null,null,null,{"$f":"AG40","v":""},{"$f":"AL40","v":0},{"$f":"VLOOKUP(AG47,data!F4:G27,2,0)","v":{"$error":"#N/A"}},{"$f":"IF(AG48>2000,2000,AG48)","v":2000},{"$f":"TEXT(AG49,\"yyyymmdd\")","v":""},{"$f":"IF(AM47=\"\",0,VLOOKUP(AM47,data!F4:G27,2,0))","v":0},{"$f":"IF(AM48=\"\",0,IF(AM48>2000,2000,AM48))","v":0},{"$f":"IF(OR(BV40=0,AM49=\"\"),0,TEXT(AM49,\"yyyymmdd\"))","v":0},{"$f":"IF(AS47=\"\",0,VLOOKUP(AS47,data!F4:G27,2,0))","v":0},{"$f":"IF(AS48=\"\",0,IF(AS48>2000,2000,AS48))","v":0},{"$f":"IF(OR(BY40=0,AS49=\"\"),0,TEXT(AS49,\"yyyymmdd\"))","v":0},{"$f":"IF(AY47=\"\",0,VLOOKUP(AY47,data!F4:G27,2,0))","v":0},{"$f":"IF(AY48=\"\",0,IF(AY48>2000,2000,AY48))","v":0},{"$f":"IF(OR(CB40=0,AY49=\"\"),0,TEXT(AY49,\"yyyymmdd\"))","v":0},{"$f":"IF(BE47=\"\",0,VLOOKUP(BE47,data!F4:G27,2,0))","v":0},{"$f":"IF(BE48=\"\",0,IF(BE48>2000,2000,BE48))","v":0},{"$f":"IF(OR(CE40=0,BE49=\"\"),0,TEXT(BE49,\"yyyymmdd\"))","v":0}]
{"$rows_left_out":59}
{"sheet":"要領2","index":4,"n_rows":32,"n_cols":28,"rows_kept":32,"cut":false,"hidden":true,"merged":[]}
[]
[]
[null,{"$f":"\"インフルエンザ予防接種補助金請求要領　（\"&data!J4&\"年度用）\"","v":"インフルエンザ予防接種補助金請求要領　（2023年度用）"},null,null,null,null,null,null,null,null,null,null,null,null,"（職場一括請求用）"]
[]
[null,null,"１．","対象者",null,"接種日時点で当健保の被保険者（本人）です。※本書で被扶養者分の請求はできません。",null,null,null,null,null,null,null,null,null,null,null,null,null,null,null,null,null,null,null,null,null,9]
[null,null,null,null,null,{"$f":"\"※ 接種対象期間 : \"&TEXT(DATE(data!J4,10,1),\"yyyy年m月d日（aaa）\")&\"～ \"&TEXT(data!J11,\"yyyy年m月d日（aaa）\")&\" 接種分\"","v":"※ 接種対象期間 : 2023年10月1日(日)～ 2024年1月31日(水) 接種分"}]
[]
[null,null,"２．","補助金額",null,{"$f":"\"インフルエンザ予防接種者一人当たり年度内上限\"&TEXT(data!J6,\"#,##0円\")","v":"インフルエンザ予防接種者一人当たり年度内上限2,000円"}]
[]
[null,null,"３．","請求方法",null,"インフルエンザ予防接種補助金請求書に、医療機関の接種証明等をもらって申請してください。"]
[]
[null,null,"４．","請求期限",null,{"$f":"TEXT(data!J5,\"yyyy年m月d日（aaa）\")&\"　健保組合到着分まで\"","v":"2024年2月13日(火)　健保組合到着分まで"}]
[null,null,null,null,null,"※ 請求期限後に到着した場合、補助金は支給できません。（請求書は返却）"]
[]
[null,null,"５．","注意点",null,"①","医療機関で、「医療機関証明」欄に接種日、１人あたり費用、接種人数、総費用の証明をもらって下さい。"]
[null,null,null,null,null,"","※ 医療機関名がゴム印の場合は、医療機関の押印は不要です。"]
[null,null,null,null,null,"②","「医療機関証明」欄に証明がもらえない場合は、請求書に全員の領収書（原本）を添えて提出して下さい。"]
[null,null,null,null,null,null,"※ 領収書には名宛が必須です。（名宛がない場合は、接種者のフルネームを補記）"]
[null,null,null,null,null,null,"※ レシート・診療明細書・接種済証は、単独では領収書の代用にはなりません。"]
[null,null,null,null,null,null,"※ レシートの場合は、接種者等が分かる診療明細書もしくは接種済証を添付してください。"]
[null,null,null,null,null,null,"※ 領収書はビニール袋等で請求書と散逸しないようにし、のり付け・ホッチキス留は厳禁です。"]
[null,null,null,null,null,null,"※ 理由を問わず、領収書は返却いたしません。"]
[null,null,null,null,null,"③","請求書を作成後に、当日接種不能となった場合は、該当者を二重線で抹消してください。"]
[]
[]
[null,null,null,"上記要領を確認しました。",null,null,null,null,null,null,null,"[確認]ボタンを押して、入力画面へ"]
[]
[]
[]
[]
[null,null,null,null,null,null,null,null,null,null,null,null,null,null,null,null,null,null,null,null,null,null,null,null,null,null,"区分",0]
[null,null,null,null,null,null,null,null,null,null,null,null,null,null,null,null,null,null,null,null,null,null,null,null,null,null,"確認"]

{"sheet":"一括","index":5,"n_rows":97,"n_cols":74,"rows_kept":97,"cut":false,"hidden":false,"merged":[[39,27,39,32],[40,27,41,32],[41,39,41,48],[39,39,39,48],[42,27,43,27],[42,28,42,35],[43,28,43,30],[43,31,43,35],[43,45,43,47],[43,48,43,52],[40,39,40,48],[40,33,41,38],[42,36,43,43],[42,44,43,44],[42,45,42,52],[40,49,41,54],[44,36,44,43],[44,45,44,47],[44,48,44,52],[44,53,44,60],[45,28,45,30],[45,31,45,35],[45,36,45,43],[45,45,45,47],[45,48,45,52],[42,53,43,60],[47,53,47,60],[46,28,46,30],[46,31,46,35],[46,36,46,43],[46,45,46,47],[46,48,46,52],[46,53,46,60],[47,28,47,30],[47,31,47,35],[47,36,47,43],[47,45,47,47],[47,48,47,52],[45,53,45,60],[44,28,44,30],[44,31,44,35],[49,53,49,60],[48,28,48,30],[48,31,48,35],[48,36,48,43],[48,45,48,47],[48,48,48,52],[48,53,48,60],[49,28,49,30],[49,31,49,35],[49,36,49,43],[49,45,49,47],[49,48,49,52],[51,53,51,60],[50,28,50,30],[50,31,50,35],[50,36,50,43],[50,45,50,47],[50,48,50,52],[50,53,50,60],[51,28,51,30],[51,31,51,35],[51,36,51,43],[51,45,51,47],[51,48,51,52],[53,53,53,60],[52,28,52,30],[52,31,52,35],[52,36,52,43],[52,45,52,47],[52,48,52,52],[52,53,52,60],[53,28,53,30],[53,31,53,35],[53,36,53,43],[53,45,53,47],[53,48,53,52],[58,40,60,55],[58,56,60,59],[59,34,59,38],[60,34,60,38],[57,28,60,28],[57,29,60,29],[57,30,57,33],[57,34,57,39],[58,30,58,33],[58,34,58,38],[59,30,59,33],[60,30,60,33],[40,55,41,60],[39,49,39,54],[39,55,39,60],[36,38,36,41],[36,43,36,45],[36,46,36,51],[36,52,36,54],[37,52,38,60],[36,55,36,60],[39,33,39,38]]}
[]
[]
[]
[null,null,{"$f":"\"インフルエンザ予防接種補助金請求書（\"&data!J4&\"年度）\"","v":"インフルエンザ予防接種補助金請求書（2023年度）"},null,null,null,null,null,null,null,null,null,null,null,null,null,null,null,null,null,null,null,null,null,null,null,null,"戻る"]
[null,null,null,"［職場一括請求用（集団請求用　被保険者限定）］",null,null,null,null,null,null,null,null,null,null,null,null,null,null,null,null,null,null,null,null,null,null,null,"e7,e9:e13,i8:j17,l8:m17"]
[null,null,null,"（本書は、複数名の申請時に使用してください。）",null,null,null,null,"（記号は左記と同一であれば省略可）"]
[null,null,null,"記号",null,null,null,null,"記号","番号",null,"記号","番号"]
[null,null,null,"事業所名",{"$f":"IF(E7=\"\",\"\",VLOOKUP(E7,data!B4:C53,2,0))","v":""},null,null,"1.",null,null,"11.",null,null,null,null,null,null,null,null,null,null,null,null,null,null,null,null,{"$f":"IF(OR(AND(I8=\"\",J8=\"\"),AND(I8<>\"\",J8=\"\")),9,1)","v":9},{"$f":"IF(AND(L8<>\"\",M8=\"\"),9,1)","v":1},null,null,{"$f":"COUNT(J8:J17,M8:M17)","v":0},"人数"]
[null,null,null,"（部店名）",null,null,null,"2.",null,null,"12.",null,null,null,null,null,null,null,null,null,null,null,null,null,null,null,null,{"$f":"IF(AND(I9<>\"\",J9=\"\"),9,1)","v":1},{"$f":"IF(AND(L9<>\"\",M9=\"\"),9,1)","v":1}]
[null,null,null,"接種日",null,null,null,"3.",null,null,"13.",null,null,null,null,null,null,null,null,null,null,null,null,null,null,null,null,1,1]
[null,null,null,"一人当たり費用",null,null,null,"4.",null,null,"14.",null,null,null,null,null,null,null,null,null,null,null,null,null,null,null,null,1,1]
[null,null,null,"担当者名",null,null,null,"5.",null,null,"15.",null,null,null,null,null,null,null,null,null,null,null,null,null,null,null,null,1,1]
[null,null,null,"連絡用Tel",null,null,null,"6.",null,null,"16.",null,null,null,null,null,null,null,null,null,null,null,null,null,null,null,null,1,1]
[null,null,null,null,null,null,null,"7.",null,null,"17.",null,null,null,null,null,null,null,null,null,null,null,null,null,null,null,null,1,1]
[null,null,null,null,null,null,null,"8.",null,null,"18.",null,null,null,null,null,null,null,null,null,null,null,null,null,null,null,null,1,1]
[null,null,null,null,null,null,null,"9.",null,null,"19.",null,null,null,null,null,null,null,null,null,null,null,null,null,null,null,null,1,1]
[null,null,null,null,null,null,null,"10.",null,null,"20.",null,null,null,null,null,null,null,null,null,null,null,null,null,null,null,null,1,1,null,null,{"$f":"COUNTBLANK(E7)+COUNTBLANK(E10:E13)+AB18","v":6},"未入力項目"]
[null,null,null,null,null,null,null,null,null,null,null,null,null,null,null,null,null,null,null,null,null,null,null,null,null,null,null,{"$f":"COUNTIF(AB8:AC17,9)","v":1},{"$f":"IF(AB18=0,\"\",IF(COUNTIF(AB8:AB17,9)>0,\"j\"&MATCH(9,AB1:AB17,0),\"m\"&MATCH(9,AC1:AC17,0)))","v":"j8"}]
[]
[]
[]
[null,null,null,null,null,null,null,null,null,null,null,null,null,null,null,null,null,null,null,null,null,null,null,null,null,null,null,{"$f":"\"日付入力方法 ： 11月15日→11/15　前年の場合→\"&data!J4&\"/11/15\"","v":"日付入力方法 ： 11月15日→11/15　前年の場合→2023/11/15"}]
[]
[null,null,null,null,null,null,null,null,null,null,null,null,null,null,null,null,null,null,null,null,null,null,null,null,null,null,null,"戻る",1]
[null,null,null,null,null,null,null,null,null,null,null,null,null,null,null,null,null,null,null,null,null,null,null,null,null,null,null,null,"戻る単票"]
[]
[null,null,null,null,null,null,null,null,null,null,null,null,null,null,null,null,null,null,null,null,null,null,null,null,null,null,null,{"$f":"MATCH(\"▼\",AA:AA,0)","v":33},{"$f":"MATCH(\"▲\",AA:AA,0)","v":82},{"$f":"AC27-AB27","v":49}]
[null,null,null,null,null,null,null,null,null,null,null,null,null,null,null,null,null,null,null,null,null,null,null,null,null,null,null,{"$f":"AB27&\":\"&AC27","v":"33:82"}]
[null,null,null,null,null,null,null,null,null,null,null,null,null,null,null,null,null,null,null,null,null,null,null,null,null,null,null,{"$f":"\"2:\"&AC27-AB27+2","v":"2:51"}]
[]
[]
[]
[null,null,null,null,null,null,null,null,null,null,null,null,null,null,null,null,null,null,null,null,null,null,null,null,null,null,"▼"]
[null,null,null,null,null,null,null,null,null,null,null,null,null,null,null,null,null,null,null,null,null,null,null,null,null,null,null,"りそな健康保険組合　御中",null,null,null,null,null,null,null,null,null,null,null,null,null,null,null,null,null,null,null,null,null,null,null,null,null,null,null,null,null,null,null,null,{"$f":"IF(AB41=0,\"請求日　　　 年　　月　　日\",\"請求日　\"&TEXT(BQ34,\"ｙｙｙｙ年 ｍ月 d日\"))","v":"請求日　　　 年　　月　　日"},null,null,null,null,null,null,"請求日",{"$f":"IF(TODAY()>E10,TODAY(),E10)","v":"2023-11-08"}]
[]
[null,null,null,null,null,null,null,null,null,null,null,null,null,null,null,null,null,null,null,null,null,null,null,null,null,null,null,{"$f":"\"インフルエンザ予防接種補助金請求書（\"&data!J4&\"年度用）\"","v":"インフルエンザ予防接種補助金請求書（2023年度用）"}]
[]
[null,null,null,null,null,null,null,null,null,null,null,null,null,null,null,null,null,null,null,null,null,null,null,null,null,null,null,"インフルエンザ予防接種を受けましたので、補助金を請求いたします。",null,null,null,null,null,null,null,null,null,null,null,null,null,null,null,null,null,null,null,null,null,null,null,null,"※全員の自署確認"]
[]
[null,null,null,null,null,null,null,null,null,null,null,null,null,null,null,null,null,null,null,null,null,null,null,null,null,null,null,"接種日",null,null,null,null,null,"一人当たり費用",null,null,null,null,null,"事業所名",null,null,null,null,null,null,null,null,null,"担当者名",null,null,null,null,null,"Tel"]
{"$rows_left_out":57}